Now with updated control file

1 job for master in 6 minutes and 44 seconds (queued for 3 seconds)
Name Stage Failure
failed
debian_amd64 Build There is an unknown failure, please try again
make[2]: Leaving directory '/home/gitlab-runner/builds/863aa137/0/dev-team/mysql-tarantool-replication'
Makefile:120: recipe for target 'all' failed
make[1]: *** [all] Error 2
make[1]: Leaving directory '/home/gitlab-runner/builds/863aa137/0/dev-team/mysql-tarantool-replication'
dh_auto_build: make -j1 returned exit code 2
debian/rules:5: recipe for target 'build' failed
make: *** [build] Error 2
dpkg-buildpackage: error: debian/rules build gave error exit status 2
ERROR: Build failed: exit status 1