Updated rules file

1 job for master in 7 minutes and 13 seconds (queued for 1 second)
Name Stage Failure
failed
debian_amd64 Build There is an unknown failure, please try again
cp: cannot stat 'debian/tmp/replicatord': No such file or directory
dh_install: cp -a debian/tmp/replicatord debian/tarantool-mysql-replicator//opt/Replicator/ returned exit code 1
debian/rules:14: recipe for target 'override_dh_install' failed
make[1]: *** [override_dh_install] Error 2
make[1]: Leaving directory '/home/gitlab-runner/builds/863aa137/0/dev-team/mysql-tarantool-replication'
debian/rules:6: recipe for target 'binary' failed
make: *** [binary] Error 2
dpkg-buildpackage: error: fakeroot debian/rules binary gave error exit status 2
ERROR: Build failed: exit status 1