Lets see if this works

1 job for master in 2 minutes (queued for 1 second)
Status Job ID Name Coverage
  Build
failed #308
debian amd64
debian_amd64

00:02:00

 
Name Stage Failure
failed
debian_amd64 Build There is an unknown failure, please try again

Makefile:69: recipe for target 'install' failed
make[1]: *** [install] Error 1
make[1]: Leaving directory '/home/gitlab-runner/builds/863aa137/0/dev-team/mysql-tarantool-replication'
dh_auto_install: make -j1 install DESTDIR=/home/gitlab-runner/builds/863aa137/0/dev-team/mysql-tarantool-replication/debian/tarantool-mysql-replicator AM_UPDATE_INFO_DIR=no returned exit code 2
debian/rules:6: recipe for target 'binary' failed
make: *** [binary] Error 2
dpkg-buildpackage: error: fakeroot debian/rules binary gave error exit status 2
ERROR: Build failed: exit status 1