..

3 jobs for master in 6 seconds (queued for 3 seconds)
Status Job ID Name Coverage
  Build
failed #158
debian i386
debian_386

00:00:03

failed #157
debian amd64
debian_amd64

00:00:03

failed #159
debian armv6
debian_armhf

 
Name Stage Failure
failed
debian_armhf Build There is an unknown failure, please try again
No job log
failed
debian_386 Build There is an unknown failure, please try again
make[2]: Leaving directory '/home/gitlab-runner/builds/57cfc137/0/r3abm/CronosAgent'
dh_auto_build: make -j1 returned exit code 2
debian/rules:7: recipe for target 'build' failed
make[1]: *** [build] Error 2
make[1]: Leaving directory '/home/gitlab-runner/builds/57cfc137/0/r3abm/CronosAgent'
dpkg-buildpackage: error: debian/rules build gave error exit status 2
Makefile:75: recipe for target 'debian-package' failed
make: *** [debian-package] Error 2
ERROR: Build failed: exit status 1
failed
debian_amd64 Build There is an unknown failure, please try again
make[2]: Leaving directory '/home/gitlab-runner/builds/57cfc137/0/r3abm/CronosAgent'
dh_auto_build: make -j1 returned exit code 2
debian/rules:7: recipe for target 'build' failed
make[1]: *** [build] Error 2
make[1]: Leaving directory '/home/gitlab-runner/builds/57cfc137/0/r3abm/CronosAgent'
dpkg-buildpackage: error: debian/rules build gave error exit status 2
Makefile:75: recipe for target 'debian-package' failed
make: *** [debian-package] Error 2
ERROR: Build failed: exit status 1